FreeBSD-main-amd64-test - Build #24188 - Still Unstable

From: <>
Date: Sat, 30 Sep 2023 07:43:41 UTC
FreeBSD-main-amd64-test - Build #24188 (480f62ccd8d998e4db9dc13c354a60f8f5e32a33) - Still Unstable

Build information:
Full change log:
Full build log:

Status explanation:
"Unstable" - some tests are suspected being broken by the following changes
"Still Unstable" - the failing test cases have not been fixed by these
                   following changes and this is a notification to note that
                   these changes have not been fully tested by the CI system

Change summaries:
(Those commits are likely but not certainly responsible)

aefda9c92da6571d405e1b27c5c68333ad8bbc57 by kp:
pf: ensure 'off' is always set before use

480f62ccd8d998e4db9dc13c354a60f8f5e32a33 by kp:
pf: only create sctp multihome states if we pass the packet

The failed test cases:

4 tests failed.
FAILED:  sys.fs.fusefs.symlink.main

Error Message:
Returned non-success exit status 1

FAILED:  sys.netinet6.frag6.frag6_19.frag6_19

Error Message:
Global IPv6 statistics do not match: 19 != 20

FAILED:  usr.bin.file.file_test.contrib_file_tests

Error Message:
atf-check failed; see the output of the test for details

FAILED:  sys.fs.tmpfs.times_test.empty

Error Message:
Incorrect atime