FreeBSD-main-amd64-test - Build #24184 - Still Unstable

From: <>
Date: Fri, 29 Sep 2023 03:08:28 UTC
FreeBSD-main-amd64-test - Build #24184 (0f87915f4338cbe2bb73999a85fb8b91a7936ac7) - Still Unstable

Build information:
Full change log:
Full build log:

Status explanation:
"Unstable" - some tests are suspected being broken by the following changes
"Still Unstable" - the failing test cases have not been fixed by these
                   following changes and this is a notification to note that
                   these changes have not been fully tested by the CI system

Change summaries:
(Those commits are likely but not certainly responsible)

ef20cd33d3287ebead0d30f2e177fc57a97dc2d5 by markj:
makefs/zfs: Ensure that the last block of a file has the right size

b6da7f2fd127f447aa20843666b98d3a1d07b8c9 by markj:
makefs/zfs tests: Add a test case which appends to a file after import

b45ab4b000b46d301a0d95b856590067e3d67eb5 by sjg:
Move the adding of CFLAGS_LAST to

d33a4ae8ba5343f555842e6e32321f9cd64dfd09 by jhb:
x86: Properly align interrupt vectors for MSI

0f87915f4338cbe2bb73999a85fb8b91a7936ac7 by sjg:
Remove unnecessary -isystem for host

The failed test cases:

6 tests failed.
FAILED:  sys.fs.fusefs.symlink.main

Error Message:
Returned non-success exit status 1

FAILED:  sys.netinet.libalias.2_natout.8_portrange

Error Message:
1 checks failed; see output for more details

FAILED:  sys.netinet6.frag6.frag6_19.frag6_19

Error Message:
Global IPv6 statistics do not match: 19 != 20

FAILED:  sys.netinet.arp.arp_add_success

Error Message:
atf-check failed; see the output of the test for details

FAILED:  usr.bin.file.file_test.contrib_file_tests

Error Message:
atf-check failed; see the output of the test for details

FAILED:  sys.fs.tmpfs.times_test.empty

Error Message:
Incorrect atime