FreeBSD-main-amd64-test - Build #24181 - Still Unstable

From: <>
Date: Thu, 28 Sep 2023 10:53:29 UTC
FreeBSD-main-amd64-test - Build #24181 (12349f38898f231ca803dcf526bac88cb1b5cd2b) - Still Unstable

Build information:
Full change log:
Full build log:

Status explanation:
"Unstable" - some tests are suspected being broken by the following changes
"Still Unstable" - the failing test cases have not been fixed by these
                   following changes and this is a notification to note that
                   these changes have not been fully tested by the CI system

Change summaries:
(Those commits are likely but not certainly responsible)

12349f38898f231ca803dcf526bac88cb1b5cd2b by zlei:
ipfw.8: Adjust section for loader tunables

The failed test cases:

3 tests failed.
FAILED:  sys.netinet6.frag6.frag6_19.frag6_19

Error Message:
Global IPv6 statistics do not match: 19 != 20

FAILED:  usr.bin.file.file_test.contrib_file_tests

Error Message:
atf-check failed; see the output of the test for details

FAILED:  sys.fs.tmpfs.times_test.empty

Error Message:
Incorrect atime