FreeBSD-stable-14-amd64-test - Build #58 - Still Unstable

From: <>
Date: Mon, 25 Sep 2023 02:19:43 UTC
FreeBSD-stable-14-amd64-test - Build #58 (6cfb90c6ebe4c2eb8de4abad679289b9a6c7aae2) - Still Unstable

Build information:
Full change log:
Full build log:

Status explanation:
"Unstable" - some tests are suspected being broken by the following changes
"Still Unstable" - the failing test cases have not been fixed by these
                   following changes and this is a notification to note that
                   these changes have not been fully tested by the CI system

Change summaries:
(Those commits are likely but not certainly responsible)

1c2aee7a5222b1b65fea07dd7ee18ae14c3f7be2 by behlendorf1:
tests: install missing PAM tests

cc75c816c539d22c56aa912d5db19827a16dcbf3 by behlendorf1:
Fix l2arc_apply_transforms ztest crash

9aa1a2878ea98f707e871833743d074a59ff2115 by behlendorf1:
Fix incorrect expected error in ztest

3af63683fe07465fd96827cab0d946cbdaba6f73 by behlendorf1:
cmd: add 'help' subcommand to zpool and zfs

729507d309d4573868855eca04f8522cc120f7d5 by behlendorf1:
Fix occasional rsend test crashes

a199cac6cdd751c02e1bd99fb02cd4623356140d by behlendorf1:
status: report pool suspension state under failmode=continue

5f30698670dec3fc2085663677021f0a592cf081 by behlendorf1:
tests/block_cloning: try harder to stay on same txg in fallback test

The failed test cases:

4 tests failed.
FAILED:  sys.netinet6.lpm6.lpm6_test1_success

Error Message:
atf-check failed; see the output of the test for details

FAILED:  usr.bin.file.file_test.contrib_file_tests

Error Message:
atf-check failed; see the output of the test for details

FAILED:  sys.fs.tmpfs.times_test.empty

Error Message:
Incorrect atime


Error Message:
Test program did not exit cleanly