FreeBSD-main-amd64-test - Build #24310 - Still Unstable

From: <>
Date: Tue, 31 Oct 2023 11:08:20 UTC
FreeBSD-main-amd64-test - Build #24310 (224fc33f603884e7eb9ed219afdd4c57ddec3cb9) - Still Unstable

Build information:
Full change log:
Full build log:

Status explanation:
"Unstable" - some tests are suspected being broken by the following changes
"Still Unstable" - the failing test cases have not been fixed by these
                   following changes and this is a notification to note that
                   these changes have not been fully tested by the CI system

Change summaries:
(Those commits are likely but not certainly responsible)

224fc33f603884e7eb9ed219afdd4c57ddec3cb9 by kib:
setkey(8): make the policy specification more readable

The failed test cases:

3 tests failed.
FAILED:  sys.netinet6.proxy_ndp.pndp_neighbor_advert

Error Message:
atf-check failed; see the output of the test for details

FAILED:  sys.netpfil.common.dummynet.pf_queue

Error Message:
We failed prioritisation 1 times

FAILED:  sys.netinet6.frag6.frag6_19.frag6_19

Error Message:
Global IPv6 statistics do not match: 19 != 20