FreeBSD-main-amd64-test - Build #24305 - Still Unstable

From: <>
Date: Mon, 30 Oct 2023 13:06:04 UTC
FreeBSD-main-amd64-test - Build #24305 (586fae3cd28661cfb45bb12306c8e6d048bb9f2e) - Still Unstable

Build information:
Full change log:
Full build log:

Status explanation:
"Unstable" - some tests are suspected being broken by the following changes
"Still Unstable" - the failing test cases have not been fixed by these
                   following changes and this is a notification to note that
                   these changes have not been fully tested by the CI system

Change summaries:
(Those commits are likely but not certainly responsible)

586fae3cd28661cfb45bb12306c8e6d048bb9f2e by kp:
Revert "pf: remove COMPAT_FREEBSD14 #ifdef from pfvar.h"

The failed test cases:

3 tests failed.
FAILED:  sys.netinet6.ndp.ndp_del_gu_success

Error Message:
atf-check failed; see the output of the test for details

FAILED:  sys.netpfil.common.dummynet.pf_queue

Error Message:
We failed prioritisation 1 times

FAILED:  sys.netinet6.frag6.frag6_19.frag6_19

Error Message:
Global IPv6 statistics do not match: 19 != 20