FreeBSD-stable-14-amd64-test - Build #132 - Still Unstable

From: <>
Date: Tue, 24 Oct 2023 23:08:23 UTC
FreeBSD-stable-14-amd64-test - Build #132 (cb63a64b8c833930628eb4a93f01956ef6e49d7c) - Still Unstable

Build information:
Full change log:
Full build log:

Status explanation:
"Unstable" - some tests are suspected being broken by the following changes
"Still Unstable" - the failing test cases have not been fixed by these
                   following changes and this is a notification to note that
                   these changes have not been fully tested by the CI system

Change summaries:
(Those commits are likely but not certainly responsible)

83a00a92dab019a4f4cd413c2a2b79f861ec0788 by jhb:
Move kern_extattr_* prototypes to <sys/syscallsubr.h>

e949b671c5550266ab88bd9d08e096af6a1550e4 by jhb:
makeman: Use ${make} instead of plain make to compute ${requireds}

973e31028bf905230ed464ee8f0e6a5ed5238d6b by jhb:
ifconfig/ifvlan.c: Whitespace fix

a74d0e30bfd6833fcbed1c710b68eccf09bb0fdc by jhb:
factor: Remove an empty #ifdef __FBSDID clause

a2972d87375377858698a3cfdfda171d79440a65 by jhb:
make_* Don't include $FreeBSD$ in generated files

495a1047514482ec66edca26190c1049fff3518d by jhb:
Retire old diskless setup scripts

c6dc53e7c80dc2acddc3df9470fd1e3bc783c8ea by jhb:
videomode/devlist2h.awk: Don't include $FreeBSD$ in generated files

62ba76f3d149fae73ca204ae75edc8cf5d388664 by jhb:
videomode: Regenerate files

5db9e9e29605616f071fc6a4cb01ff464d47848f by jhb:
Remove a few more stray __FBSDID uses

efb26b3fe6ca47738754b89d4d2e82fcd7473619 by jhb:
Update a couple of tools to not embed __FBSDID in generated files

97cb7bde896d2661bd0405b94d60297c51eb7c7c by jhb:
lpr: Remove now unused fallback definition for __FBSDID

260bab9f1e6f2a770eab029f5b37e6f4fa12edbe by jhb:
Purge more stray embedded $FreeBSD$ strings

058aa09fa32f4b97887dacffa0651f455379546e by jhb:
powerpc/ Don't include $FreeBSD$ in prefix to uuencoded

8f7aafe29f4a3716635a501ea3ef0177a5fdffe9 by jhb:
Update a few tools to not embed $FreeBSD$ in generated files

37d19dd86af32bb44f82f7b00c5a95cbee7642dc by jhb:
sendmail: Drop $FreeBSD$ from .mc files

bfa1565246cf02153749d2635814b03ad5d61d38 by jhb:
Trim various $FreeBSD$

92b8ce704a091719d8e0d2d4957bacf4b9882a63 by jhb:
riscv: Tidy panic messages for exceptions

fbeb784ff471375a5fa1e82bd232e335fcefbd8d by jhb:
amd64: Remove a stale comment from cpu_setregs

cfdb5e70adb3614f70a35240eab89519a5536d2c by jhb:
bhyve: Document the hw.vmm.maxcpu tunable and the current limit on vCPUs

67d6141e1581897d0fd1e1ecf35a99d088b10f97 by jhb:
bhyve: Some fwctl simplifications.

13c8d5bf334d6afe66c125fc9ab1ace62e3364fc by jhb:
bhyve ahci: Replace WPRINTF with EPRINTLN

3cf142f1bc5f84eb229eed1ec08ed7e14cf25379 by jhb:
bhyve: Replace many fprintf(stderr, ...) calls with EPRINTLN

76b37faac869aac7e889da3ac291207606a20e51 by jhb:
acpi_pcib: Trust decoded bus range from _CRS over _BBN

c8cf2d16139042dd9eb3ba0324c88c4cfffe7d93 by jhb:
Add support for Chacha20-Poly1305 to kernel TLS on FreeBSD.

400229e8d97cda4e198c5640dca6a0a6b70a659e by jhb:
KTLS: Check for unprocessed receive records in ktls_configure_crypto.

65e292cdf15539472ffe3ecf561951d08fa2a76d by jhb:
KTLS: Add using_ktls helper variable in ssl3_get_record().

4d85e7386f7756c98f3e4ae1fb0037b56903510f by jhb:
KTLS: Handle TLS 1.3 in ssl3_get_record.

263d7e50adb8d0d72ab287b1210002fb2fe4b6b6 by jhb:
KTLS: Enable KTLS for receiving as well in TLS 1.3

e8daee32125301676fb246671532abffbdca3e77 by jhb: Remove old mixer(8) tests

0e496388ef1bc9001378201bf8af2115d8739500 by jhb:
x86 msi: Enable/disable IDT vectors for MSI groups all at once

89160477956bf3dff2faa7eeedd0d67fb7a60efe by jhb:
x86: Cosmetic cleanups to struct msi_intsrc

cb63a64b8c833930628eb4a93f01956ef6e49d7c by jhb:
acpi_pcib: Rename decoded_bus_range to get_decoded_bus_range

The failed test cases:

5 tests failed.
FAILED:  sys.netinet6.frag6.frag6_04.frag6_04

Error Message:
atf-check failed; see the output of the test for details

FAILED:  sys.netpfil.common.tos.pf_tos

Error Message:
atf-check failed; see the output of the test for details


Error Message:
atf-check failed; see the output of the test for details

FAILED:  usr.bin.file.file_test.contrib_file_tests

Error Message:
atf-check failed; see the output of the test for details


Error Message:
Test program did not exit cleanly