FreeBSD-main-amd64-test - Build #24291 - Still Unstable

From: <>
Date: Sat, 21 Oct 2023 09:03:00 UTC
FreeBSD-main-amd64-test - Build #24291 (7a974a649848e1222a49d0d49726d06bd5c1dbd9) - Still Unstable

Build information:
Full change log:
Full build log:

Status explanation:
"Unstable" - some tests are suspected being broken by the following changes
"Still Unstable" - the failing test cases have not been fixed by these
                   following changes and this is a notification to note that
                   these changes have not been fully tested by the CI system

Change summaries:
(Those commits are likely but not certainly responsible)

7a974a649848e1222a49d0d49726d06bd5c1dbd9 by zlei:
bpf: Make dead_bpf_if const

The failed test cases:

3 tests failed.
FAILED:  sys.netinet6.frag6.frag6_19.frag6_19

Error Message:
Global IPv6 statistics do not match: 19 != 20

FAILED:  sys.netinet6.lpm6.lpm6_test2_success

Error Message:
atf-check failed; see the output of the test for details

FAILED:  sys.fs.tmpfs.times_test.empty

Error Message:
Incorrect atime