FreeBSD-stable-14-amd64-test - Build #116 - Still Unstable

From: <>
Date: Wed, 18 Oct 2023 20:14:02 UTC
FreeBSD-stable-14-amd64-test - Build #116 (07c60e63237e1d4657cfbd6b03116c4913827e8c) - Still Unstable

Build information:
Full change log:
Full build log:

Status explanation:
"Unstable" - some tests are suspected being broken by the following changes
"Still Unstable" - the failing test cases have not been fixed by these
                   following changes and this is a notification to note that
                   these changes have not been fully tested by the CI system

Change summaries:
(Those commits are likely but not certainly responsible)

62ce4a798f2c8a6357e8bc0c46e0f3e077ca1958 by manu:
cpufreq_dt: Find the closest frequency

ab8f34675ae705060a6160521b1e7a91c5e00a9a by manu:
arm64: zynqmp: Add firmware driver

20d6c796fae0d3075485159514825a9090e50ce8 by manu:
arm64: zynqmp: Add clock driver

023ba06b4f95fa106e6bda2fe349ff32f9ab42c9 by manu:
sdhci: fdt: Remove sdhci_generic compatible string

d6a1d41df4faf10bb66e62a6bb2ecc5c3b3d43cd by manu:
sdhci: fdt: Always enable clock for ZynqMP and RK3399

62b14a75310be97c13eafb236447bbf2ef54f357 by manu:
sdhci: fdt: Always try to get the phy and the syscon

0af2307d592651ec4d020af9f20ae9e214d5bc9d by manu:
sdhci: fdt: Correctly export clock per the binding

770b790eabac42e6c22886439d1d776cbf0ff455 by manu:
if_cgem: Cleanup compatible and add new ones

1e685c7dd5c01955d1aee233bf79b61fc1f0a8a3 by manu:
if_cgem: Rewrite clock part

a5b3cbe6cc68a42e8474f27fb9272c245c16bc67 by manu:
iicbus: Move twsi under a new controller subdirectory

5e25c410bde7e7eadc9556d6eb1c97ea373b20ea by manu:
iicbus: Move remaining rtc driver into rtc subfolder

8d715e2f4912c7190853994aede086d81c66c481 by manu:
iicbus: Move Silergy pmic/regulators under pmic/silergy subdirectory

26dd10a4f31ffdcd242df0ca2c49c58105fb72b9 by manu:
iicbus: Move adm1030 and adt746x to new pwm subdirectory

cd2f6226e793babb9f4a35223d3843daa0cf051f by manu:
iicbus: Move ADC drivers into a new adc subfolder

83dcc494a7fa20a0e5fa76c060422b47a02a1c99 by manu:
iicbus: conf: Fix pcf8574 entry

96edbfe36b0534c94998f0ae0decf01bbc6bd756 by manu:
iicbus: Move i2c sensors drivers into new sensor subdirectory

c1335891057c90000ab185c1c1fbd893a809fa8b by manu:
iicbus: Move opencores i2c driver into controller subdirectory

7b824791e7a3008aeab39186610da41d28fd8eaf by manu:
i2c: Add cadence iic driver

b4cd14485a8efaf98d497351e9b88ad0ccca8c97 by manu:
i2c: Add Microcrystal RV3032 RTC driver

26bf8fff64e5d4ede9c4772a698ca2540cffccab by manu:
xilinx: reset: Remove debug printfs

dda809fb31a7d4049aa5b1bc8adc1743a5ac92fb by manu:
arm64: rockchip: clk: Define PLIST macro in rk_cru.h

90b135d8c2926254eea2a6e71a40590f728dbfc3 by manu:
arm64: rockchip: rk3568_pmucru: Rewrite

4bb49357e094afad2d616197e150c4788a9ab0ed by manu:
arm64: rockchip: rk3568_cru: Rewrite

14652ce3f5427daffd5dc4db910db95325d5e06f by manu:
arm64: rockchip: rk3328_cru: Use GATE macro

1469218c9ca2bd137ae978d5ae93ebbedefc52bb by manu:
arm64: rockchip: rk3399_pmucru: Use GATE macro

66765585ab7bbd70c5f39906fedca472b348629a by manu:
arm64: rockchip: Remove CRU_GATE macro

57209137eb7e57b3f820655431d4d42fb8c6464e by manu:
arm64: rockchip: rk3399_pmucru: Finish exporting all clocks

fd4760cbda85016b1bc551458f09c5f51814e586 by manu:
arm64: rockchip: rk_clk_composite: Remove gate code

d10e2facd6deb9bbb0d6dfd22a91e0891c3855fb by manu:
arm64: dtb: Add rk3566-quartz64-a.dts to the build

d7d51aad8fc6b8428c8de442faab4a49e5f4c5b9 by manu:
iicbus: pmic: rk8xx: Fix logic in clock-output-names detection

8cb78c56a6bbf6b7ad0611ba6131ae208c3889c4 by manu:
arm64: dtb: Add rk3568-nanopi-r5s.dts to the build

e8d7fd8991bf5de5d2526a21ae8924315ecca563 by manu:
i2c: rtc: Add module for hym8563 driver

23ddec9e8f6bde711ff65e48b7345757516189d8 by manu:
mtree: Add missing sound entry for /usr/examples

a01e703e50185cf30f9b7d0566656c7d08e55a67 by manu:
pkgbase: Move blacklist utilities to a new package

08e6279a9f6f5a41fbeaeb3cc3ff93dc0a4d7d38 by manu:
pkgbase: Move uuidgen to runtime package

3469786f20357f45a0e07878f5e4623d139d6e0f by manu:
pkgbase: Put atf_python files in FreeBSD-tests

141fe209e367de8a1c251e9ec34e10ee64ef8263 by manu:
arm/allwinner: fix variables initialization in clkng

03ef42bbe15aed9226939daf2f3b0e10183dea7e by manu:
pkgbase: Fix ucl for libcompiler_rt

5401ebd33cf5073e8c0f095527504d38f74a926b by imp:
mkimg: Ensure GPT Entry Array is at least 16k

4a3cdf4168953c01b8b0e6a9ca72804ef2860309 by imp:
mkimg_test: remove vtoc8 images, they aren't needed

524225dde0b5a4f346644670f22fcd11fe13c1f2 by imp:
mkimg: Regenerate all the tests for gpt

9ed4f43bc4c39dc5ed2ce1bf6003e4dcb4160bfc by imp:
Remove $FreeBSD$: one line sh-pattern

07c60e63237e1d4657cfbd6b03116c4913827e8c by mhorne:
Make cr_bsd_visible()'s sub-functions internal

The failed test cases:

7 tests failed.

Error Message:
atf-check failed; see the output of the test for details

FAILED:  sys.geom.class.gate.ggate_test.ggated

Error Message:
atf-check failed; see the output of the test for details


Error Message:
atf-check failed; see the output of the test for details


Error Message:
atf-check failed; see the output of the test for details

FAILED:  usr.bin.file.file_test.contrib_file_tests

Error Message:
atf-check failed; see the output of the test for details

FAILED:  sys.fs.tmpfs.times_test.empty

Error Message:
Incorrect atime


Error Message:
Test program did not exit cleanly