FreeBSD-main-amd64-test - Build #24268 - Still Unstable

From: <>
Date: Tue, 17 Oct 2023 12:05:29 UTC
FreeBSD-main-amd64-test - Build #24268 (4f8f43b06ed07e96a250855488cc531799d5b78f) - Still Unstable

Build information:
Full change log:
Full build log:

Status explanation:
"Unstable" - some tests are suspected being broken by the following changes
"Still Unstable" - the failing test cases have not been fixed by these
                   following changes and this is a notification to note that
                   these changes have not been fully tested by the CI system

Change summaries:
(Those commits are likely but not certainly responsible)

1c5c7e61c85fffa274119a69d69b3405848b9c82 by kp:
netlink: add attr parser utility functions

fad5734995e3fba428ce5e4131389c4fff0610ab by kp:
netlink: descend into nested parsers when verifying

4f8f43b06ed07e96a250855488cc531799d5b78f by kp:
netlink: cope with growing requests

The failed test cases:

3 tests failed.
FAILED:  sys.netinet6.lpm6.lpm6_test1_success

Error Message:
atf-check failed; see the output of the test for details

FAILED:  sys.netinet6.frag6.frag6_19.frag6_19

Error Message:
Global IPv6 statistics do not match: 19 != 20

FAILED:  sys.fs.tmpfs.times_test.empty

Error Message:
Incorrect atime