FreeBSD-main-amd64-test - Build #24261 - Still Unstable

From: <>
Date: Sun, 15 Oct 2023 22:18:31 UTC
FreeBSD-main-amd64-test - Build #24261 (c08ba4a588d517e3c5fe00cee0927294d2490993) - Still Unstable

Build information:
Full change log:
Full build log:

Status explanation:
"Unstable" - some tests are suspected being broken by the following changes
"Still Unstable" - the failing test cases have not been fixed by these
                   following changes and this is a notification to note that
                   these changes have not been fully tested by the CI system

Change summaries:
(Those commits are likely but not certainly responsible)

6ace92326f3cc4bbee9b74f6b656cb13699a78a2 by kp:
ifconfig: add static bridge addresses for vlan 0, not 1

c08ba4a588d517e3c5fe00cee0927294d2490993 by emaste:
efibootmgr: provide explicit error message if run as non-root

The failed test cases:

3 tests failed.
FAILED:  sys.netinet6.proxy_ndp.pndp_neighbor_advert

Error Message:
atf-check failed; see the output of the test for details

FAILED:  sys.netinet6.frag6.frag6_19.frag6_19

Error Message:
Global IPv6 statistics do not match: 19 != 20

FAILED:  sys.fs.tmpfs.times_test.empty

Error Message:
Incorrect atime