FreeBSD-main-amd64-test - Build #24258 - Still Unstable

From: <>
Date: Sat, 14 Oct 2023 08:02:10 UTC
FreeBSD-main-amd64-test - Build #24258 (a5ed6a815e38d6c622cd97a6020592ded579cf7a) - Still Unstable

Build information:
Full change log:
Full build log:

Status explanation:
"Unstable" - some tests are suspected being broken by the following changes
"Still Unstable" - the failing test cases have not been fixed by these
                   following changes and this is a notification to note that
                   these changes have not been fully tested by the CI system

Change summaries:
(Those commits are likely but not certainly responsible)

c545a7b2c7db90b7647ef0a4f1fce05e4d7664a0 by chs:
prf: add setting of msgbuftrigger in paths where it is missing

a5ed6a815e38d6c622cd97a6020592ded579cf7a by emaste:
ptsname.3: accommodate upcoming POSIX Issue 8 ptsname_r

The failed test cases:

5 tests failed.
FAILED:  sys.netinet.arp.arp_add_success

Error Message:
atf-check failed; see the output of the test for details


Error Message:
/usr/local/lib/python3.9/multiprocessing/ EOFError

FAILED:  sys.netpfil.common.dummynet.pf_queue

Error Message:
We failed prioritisation 1 times

FAILED:  sys.netinet6.frag6.frag6_19.frag6_19

Error Message:
Global IPv6 statistics do not match: 19 != 20

FAILED:  sys.fs.tmpfs.times_test.empty

Error Message:
Incorrect atime