FreeBSD-main-amd64-test - Build #24255 - Still Unstable

From: <>
Date: Fri, 13 Oct 2023 15:26:09 UTC
FreeBSD-main-amd64-test - Build #24255 (6aa641b71d0dd1b26674f0b6dba086410f643595) - Still Unstable

Build information:
Full change log:
Full build log:

Status explanation:
"Unstable" - some tests are suspected being broken by the following changes
"Still Unstable" - the failing test cases have not been fixed by these
                   following changes and this is a notification to note that
                   these changes have not been fully tested by the CI system

Change summaries:
(Those commits are likely but not certainly responsible)

c57ff818f61483c3131dc4fb6dd87ede7ab29bba by noreply:
config/zfs-build.m4: add Gentoo's bash-completion path

008baa091f39487fd053fece42be4fd23a09d4d4 by noreply:
FreeBSD: Reduce divergence from in-tree sources

954a380e19c9905deb2152275b13a0fb787b6923 by noreply:
ZTS: Move zpool_import_hostid_changed* tests to Linux runfile

250349ffffbaefd356a28cc900ad73a3fe0e60c0 by noreply:
ZTS: Fix verify_fs_mount in delegate_common.kshlib

dc1d3303d25b32fe1ef25be74bfa76f29c5b3027 by behlendorf1:
mailmap: initial, trying to tidy up a lot of the commit history

000cfca0689a988a5a0973245b9a90529e4778fb by behlendorf1:
update_authors: add missing names from commits to AUTHORS

28096c7c13a1945c5830c1b7f88de4fe8e88f09d by behlendorf1:
AUTHORS: update with missing names

aefb6a2bd6c24597cde655e9ce69edd0a4c34357 by noreply:
zvol: Temporally disable blk-mq

483ccf0c630deeb3a3376c6072c0a8fd83848283 by noreply:
ZTS: Remove zfs_allow_010_pos expection for FreeBSD

bc29124b1bf90eae7e9539bcafeb109e4df821ac by noreply:
Ensure we call fput when cloning fails due to different devices.

822b32ee51ccf2e24a358e4927b4a218e9b81925 by noreply:
CI: Move perl script to dist_noinst_DATA

9facf2d1ad0c4857de1d47a2a14e882a3fb78b89 by noreply:
ZTS: Debug zfs_share_concurrent_shares failure

1b310dfb1d5aa90db7d8c4ec8d6a92b4430b0496 by noreply:
DMU: Do not pre-read holes during write

fd5128622783735b3f0334c668bca8013cbcd487 by noreply:
spec: define _bashcompletiondir if undefined

8a740701283495e59944839bb2607f80907d950e by noreply:
Zpool can start allocating from metaslab before TRIMs have completed

81647eb60ee387b0b33ac42deacd25edace2661e by kp:
pf: implement start/stop calls via netlink

4095e0bcb9e8fac51eedad89211a5b16af7f55ad by kib:
arm64 locore.S: fix typos

ac63f7534d0102352bf993ebe2c748ce2ffd432e by kib:
arm64, riscv: Use KSTACK_PAGES for the thread0 kstack size designator

39cddbd7a07c182c4f121bea5a6effa36862fc63 by kib:
arm64: do not disable the kern.kstack_pages tunable on arm64

6aa641b71d0dd1b26674f0b6dba086410f643595 by kib:
arm64, risvc: warn about ignored kstack_pages for thread0

The failed test cases:

4 tests failed.

Error Message:
/usr/tests/atf_python/sys/net/ IndexError

FAILED:  sys.netpfil.common.dummynet.pf_queue

Error Message:
We failed prioritisation 1 times

FAILED:  sys.netinet6.frag6.frag6_19.frag6_19

Error Message:
Global IPv6 statistics do not match: 19 != 20

FAILED:  sys.fs.tmpfs.times_test.empty

Error Message:
Incorrect atime