FreeBSD-main-amd64-test - Build #24251 - Still Unstable

From: <>
Date: Fri, 13 Oct 2023 05:16:49 UTC
FreeBSD-main-amd64-test - Build #24251 (d287d3282f43b92e59aa74725e72662758e96a75) - Still Unstable

Build information:
Full change log:
Full build log:

Status explanation:
"Unstable" - some tests are suspected being broken by the following changes
"Still Unstable" - the failing test cases have not been fixed by these
                   following changes and this is a notification to note that
                   these changes have not been fully tested by the CI system

Change summaries:
(Those commits are likely but not certainly responsible)

944223076fbcb681a8eb3e118ddafab79b21ac3d by manu:
pkgbase: Put atf_python files in FreeBSD-tests

43cd6bbba053f02999d846ef297655ebec2d218b by manu:
dwc: re-rewrite barrier part

4d19eceaefb7106d761bc9504bb0da737ae0d674 by kp:
pf: Free pf_rule_items when state is not created

da202b0fe616e9314739f01493ae310e37a36d8d by jhb:
bhyve: Document the hw.vmm.maxcpu tunable and the current limit on vCPUs

d287d3282f43b92e59aa74725e72662758e96a75 by asiciliano:
libbsddialog: delete formw dependency

The failed test cases:

3 tests failed.
FAILED:  sys.netpfil.common.dummynet.pf_queue

Error Message:
We failed prioritisation 1 times

FAILED:  sys.netinet6.frag6.frag6_19.frag6_19

Error Message:
Global IPv6 statistics do not match: 19 != 20

FAILED:  sys.fs.tmpfs.times_test.empty

Error Message:
Incorrect atime