FreeBSD-main-amd64-test - Build #24249 - Still Unstable

From: <>
Date: Thu, 12 Oct 2023 17:08:40 UTC
FreeBSD-main-amd64-test - Build #24249 (261cda20e11caa272517443aab7549b35667e31f) - Still Unstable

Build information:
Full change log:
Full build log:

Status explanation:
"Unstable" - some tests are suspected being broken by the following changes
"Still Unstable" - the failing test cases have not been fixed by these
                   following changes and this is a notification to note that
                   these changes have not been fully tested by the CI system

Change summaries:
(Those commits are likely but not certainly responsible)

261cda20e11caa272517443aab7549b35667e31f by ceri:
UPDATING: fix typo

The failed test cases:

3 tests failed.
FAILED:  sys.kqueue.libkqueue.kqueue_test.main

Error Message:
Returned non-success exit status 1

FAILED:  sys.netinet6.lpm6.lpm6_test1_success

Error Message:
atf-check failed; see the output of the test for details

FAILED:  sys.fs.tmpfs.times_test.empty

Error Message:
Incorrect atime