FreeBSD-main-amd64-test - Build #24240 - Still Unstable

From: <>
Date: Wed, 11 Oct 2023 07:32:50 UTC
FreeBSD-main-amd64-test - Build #24240 (7fd2c91a291bd518e012b438d6ca6fdd04d39dbf) - Still Unstable

Build information:
Full change log:
Full build log:

Status explanation:
"Unstable" - some tests are suspected being broken by the following changes
"Still Unstable" - the failing test cases have not been fixed by these
                   following changes and this is a notification to note that
                   these changes have not been fully tested by the CI system

Change summaries:
(Those commits are likely but not certainly responsible)

bc85cd303c448b5006975024c4b468f5614507c5 by imp:
nvme: gc nvme_ctrlr_post_failed_request and related task stuff

4026128983ed93df89e1e800ee1404a57aa749a7 by imp:
nvme: Really remove NVME_2X_RESET

6b2a6e9cb09b1250b2a4042e0bfc60ae43835fc7 by imp:
nvme: Remove stale comment

9cd7b624732c3b675178b02b7447272f67a3203d by imp:
nvme: Eliminate RECOVERY_FAILED state

afc3d49b17a35db3b70c9e4f63a508a14a8237fe by imp:
nvme: Close a race in destroying qpair and timeouts

26103ccba8b75038bd83773268524ac814bfa334 by mm:
zfs: enable block cloning by default

7fd2c91a291bd518e012b438d6ca6fdd04d39dbf by des:
ping: Simplify protocol selection.

The failed test cases:

3 tests failed.
FAILED:  sys.netinet6.lpm6.lpm6_test2_success

Error Message:
atf-check failed; see the output of the test for details

FAILED:  sys.netinet6.frag6.frag6_19.frag6_19

Error Message:
Global IPv6 statistics do not match: 19 != 20

FAILED:  sys.fs.tmpfs.times_test.empty

Error Message:
Incorrect atime