FreeBSD-main-amd64-test - Build #24227 - Still Unstable

From: <>
Date: Sun, 08 Oct 2023 14:12:17 UTC
FreeBSD-main-amd64-test - Build #24227 (38ecc80b2a4e5e11ece83ca4df63632f0b6fa394) - Still Unstable

Build information:
Full change log:
Full build log:

Status explanation:
"Unstable" - some tests are suspected being broken by the following changes
"Still Unstable" - the failing test cases have not been fixed by these
                   following changes and this is a notification to note that
                   these changes have not been fully tested by the CI system

Change summaries:
(Those commits are likely but not certainly responsible)

38ecc80b2a4e5e11ece83ca4df63632f0b6fa394 by zlei:
tcp: Simplify the initialization of loader tunable

The failed test cases:

3 tests failed.
FAILED:  sys.netinet6.frag6.frag6_19.frag6_19

Error Message:
Global IPv6 statistics do not match: 19 != 20

FAILED:  usr.bin.file.file_test.contrib_file_tests

Error Message:
atf-check failed; see the output of the test for details

FAILED:  sys.fs.tmpfs.times_test.empty

Error Message:
Incorrect atime