FreeBSD-main-amd64-test - Build #24215 - Still Unstable

From: <>
Date: Fri, 06 Oct 2023 15:56:00 UTC
FreeBSD-main-amd64-test - Build #24215 (6594288a6088caf9821487637d5d6ee8c27cd558) - Still Unstable

Build information:
Full change log:
Full build log:

Status explanation:
"Unstable" - some tests are suspected being broken by the following changes
"Still Unstable" - the failing test cases have not been fixed by these
                   following changes and this is a notification to note that
                   these changes have not been fully tested by the CI system

Change summaries:
(Those commits are likely but not certainly responsible)

3a11944bca0f07079a61f10468b704589c52a76f by bz:
net80211: pass __func__, __LINE__ also to ieee80211_alloc_node()

299e2d5724c2bc4929b6eac3258f04055e97992e by bz:
rtw88: re-connect to the build

70a0fb43f91cfe3d08db7cb443d9690f8bff065e by des:
growfs: make exit codes more consistent

6594288a6088caf9821487637d5d6ee8c27cd558 by des:
mailmap: Add pstef and val

The failed test cases:

3 tests failed.
FAILED:  sys.netinet6.frag6.frag6_19.frag6_19

Error Message:
Global IPv6 statistics do not match: 19 != 20

FAILED:  usr.bin.file.file_test.contrib_file_tests

Error Message:
atf-check failed; see the output of the test for details

FAILED:  sys.fs.tmpfs.times_test.empty

Error Message:
Incorrect atime