FreeBSD-main-amd64-test - Build #24213 - Still Unstable

From: <>
Date: Fri, 06 Oct 2023 08:57:09 UTC
FreeBSD-main-amd64-test - Build #24213 (6e5dcc6113da649a79e5bc2c3ea9329bcd1d85d5) - Still Unstable

Build information:
Full change log:
Full build log:

Status explanation:
"Unstable" - some tests are suspected being broken by the following changes
"Still Unstable" - the failing test cases have not been fixed by these
                   following changes and this is a notification to note that
                   these changes have not been fully tested by the CI system

Change summaries:
(Those commits are likely but not certainly responsible)

6e5dcc6113da649a79e5bc2c3ea9329bcd1d85d5 by emaste:
Connect mitigations(7) to the build

The failed test cases:

4 tests failed.
FAILED:  sys.fs.fusefs.mknod.main

Error Message:
Returned non-success exit status 1

FAILED:  sys.netinet6.frag6.frag6_19.frag6_19

Error Message:
Global IPv6 statistics do not match: 19 != 20

FAILED:  usr.bin.file.file_test.contrib_file_tests

Error Message:
atf-check failed; see the output of the test for details

FAILED:  sys.fs.tmpfs.times_test.empty

Error Message:
Incorrect atime