FreeBSD-main-amd64-test - Build #24209 - Still Unstable

From: <>
Date: Thu, 05 Oct 2023 15:18:54 UTC
FreeBSD-main-amd64-test - Build #24209 (77e93191b92eed7842f56154eed1d1d0519dd65c) - Still Unstable

Build information:
Full change log:
Full build log:

Status explanation:
"Unstable" - some tests are suspected being broken by the following changes
"Still Unstable" - the failing test cases have not been fixed by these
                   following changes and this is a notification to note that
                   these changes have not been fully tested by the CI system

Change summaries:
(Those commits are likely but not certainly responsible)

956a46311462423f97b2410065f8caff2c630701 by kp:
if_ovpn tests: fix ra test

e19b2ef976d326d34b17331c5071d9e687d0d5d5 by bapt:
genl: add a monitor subcommand

77e93191b92eed7842f56154eed1d1d0519dd65c by bapt:
bsdconfig: drop support for floppies

The failed test cases:

3 tests failed.
FAILED:  sys.netinet6.frag6.frag6_19.frag6_19

Error Message:
Global IPv6 statistics do not match: 19 != 20

FAILED:  usr.bin.file.file_test.contrib_file_tests

Error Message:
atf-check failed; see the output of the test for details

FAILED:  sys.fs.tmpfs.times_test.empty

Error Message:
Incorrect atime