FreeBSD-stable-14-amd64-test - Build #86 - Still Unstable

From: <>
Date: Thu, 05 Oct 2023 12:07:29 UTC
FreeBSD-stable-14-amd64-test - Build #86 (fb058a9a40a5adc82721ed822fb4fba213446a7b) - Still Unstable

Build information:
Full change log:
Full build log:

Status explanation:
"Unstable" - some tests are suspected being broken by the following changes
"Still Unstable" - the failing test cases have not been fixed by these
                   following changes and this is a notification to note that
                   these changes have not been fully tested by the CI system

Change summaries:
(Those commits are likely but not certainly responsible)

fb058a9a40a5adc82721ed822fb4fba213446a7b by des:
libfetch: don't rely on ca_root_nss for certificate validation

The failed test cases:

4 tests failed.
FAILED:  sys.kern.ptrace_test.ptrace__PT_KILL_competing_stop

Error Message:
/usr/src/tests/sys/kern/ptrace_test.c:2213: pl.pl_flags & PL_FLAG_SCX not met

FAILED:  usr.bin.file.file_test.contrib_file_tests

Error Message:
atf-check failed; see the output of the test for details

FAILED:  sys.fs.tmpfs.times_test.empty

Error Message:
Incorrect atime


Error Message:
Test program did not exit cleanly