FreeBSD-main-amd64-test - Build #24204 - Still Unstable

From: <>
Date: Wed, 04 Oct 2023 13:24:53 UTC
FreeBSD-main-amd64-test - Build #24204 (f06c928544747326c04f84c582bcd5fda0d7bb91) - Still Unstable

Build information:
Full change log:
Full build log:

Status explanation:
"Unstable" - some tests are suspected being broken by the following changes
"Still Unstable" - the failing test cases have not been fixed by these
                   following changes and this is a notification to note that
                   these changes have not been fully tested by the CI system

Change summaries:
(Those commits are likely but not certainly responsible)

74c2461386ea5eeb41e674df6b16a44b0509a882 by kp:
pf: cope with missing rpool.cur

f06c928544747326c04f84c582bcd5fda0d7bb91 by bz:
LinuxKPI: remove dummy headers with implementations

The failed test cases:

6 tests failed.
FAILED:  sys.fs.fusefs.symlink.main

Error Message:
Returned non-success exit status 1


Error Message:
/usr/tests/atf_python/sys/net/ IndexError

FAILED:  sys.fs.fusefs.mknod.main

Error Message:
Returned non-success exit status 1

FAILED:  sys.netinet6.frag6.frag6_19.frag6_19

Error Message:
Global IPv6 statistics do not match: 19 != 20

FAILED:  usr.bin.file.file_test.contrib_file_tests

Error Message:
atf-check failed; see the output of the test for details

FAILED:  sys.fs.tmpfs.times_test.empty

Error Message:
Incorrect atime