FreeBSD-main-amd64-test - Build #24202 - Still Unstable

From: <>
Date: Wed, 04 Oct 2023 08:46:58 UTC
FreeBSD-main-amd64-test - Build #24202 (6c38c6b1b917957d420902213f318bf0153214f2) - Still Unstable

Build information:
Full change log:
Full build log:

Status explanation:
"Unstable" - some tests are suspected being broken by the following changes
"Still Unstable" - the failing test cases have not been fixed by these
                   following changes and this is a notification to note that
                   these changes have not been fully tested by the CI system

Change summaries:
(Those commits are likely but not certainly responsible)

1e99b2ee90956f275c3668e92a408400f2dada1c by dumbbell:
linuxkpi: Fix uses of `pmap_change_attr()`

6c38c6b1b917957d420902213f318bf0153214f2 by bz:
LinuxKPI: 802.11: fix re-creation of VAP

The failed test cases:

3 tests failed.
FAILED:  sys.netinet6.frag6.frag6_19.frag6_19

Error Message:
Global IPv6 statistics do not match: 19 != 20

FAILED:  usr.bin.file.file_test.contrib_file_tests

Error Message:
atf-check failed; see the output of the test for details

FAILED:  sys.fs.tmpfs.times_test.empty

Error Message:
Incorrect atime