FreeBSD-stable-14-amd64-test - Build #78 - Still Unstable

From: <>
Date: Mon, 02 Oct 2023 14:38:22 UTC
FreeBSD-stable-14-amd64-test - Build #78 (3ab984bbe0144f029d27a9ca0628b1f47a419688) - Still Unstable

Build information:
Full change log:
Full build log:

Status explanation:
"Unstable" - some tests are suspected being broken by the following changes
"Still Unstable" - the failing test cases have not been fixed by these
                   following changes and this is a notification to note that
                   these changes have not been fully tested by the CI system

Change summaries:
(Those commits are likely but not certainly responsible)

0ac8d8d9954f2d446d4fa7a5f154d55931f3d1f1 by kp:
pf: support SCTP multihoming

2537ad522d85be44cfe3d61a1fc873bebe0fef28 by kp:
pf tests: basic SCTP multihoming test

48172aad8143d72fa2af363f4b6da0bf1c522789 by kp:
pf: improve SCTP state validation

45f475427d8e8e1583104350699620fc8aee8735 by kp:
pf: inherit v_tag values to multihomed connections

6d1714a44e634f3063f6cd0a4fab0782ddc87fe7 by kp:
pf: mark removed connections within a multihome association as shutting

35dd8c4e7887874f883668111e1c58d583d78f4b by kp:
pf tests: extend SCTP tests to test state removal through ASCONF

bcad901cbfda785298740cf6e0271b874d348503 by kp:
pf: ensure 'off' is always set before use

3ab984bbe0144f029d27a9ca0628b1f47a419688 by kp:
pf: only create sctp multihome states if we pass the packet

The failed test cases:

5 tests failed.

Error Message:
/usr/local/lib/python3.9/multiprocessing/ EOFError

FAILED:  sys.netinet6.frag6.frag6_10.frag6_10

Error Message:
atf-check failed; see the output of the test for details

FAILED:  usr.bin.file.file_test.contrib_file_tests

Error Message:
atf-check failed; see the output of the test for details

FAILED:  sys.fs.tmpfs.times_test.empty

Error Message:
Incorrect atime


Error Message:
Test program did not exit cleanly