FreeBSD-stable-14-amd64-test - Build #213 - Still unstable

From: <>
Date: Thu, 30 Nov 2023 07:44:29 UTC
FreeBSD-stable-14-amd64-test - Build #213 (a8c36fd7a3e8af322bdb06886e40a79d1a614ac6) - Still unstable

Build information:
Full change log:
Full build log:

Status explanation:
"Unstable" - some tests are suspected being broken by the following changes
"Still Unstable" - the failing test cases have not been fixed by these
                   following changes and this is a notification to note that
                   these changes have not been fully tested by the CI system

Change summaries:
(Those commits are likely but not certainly responsible)

c18c5774e022b92296d27c88f30412de455b456b by asomers:
fusefs: add more readdir tests for misbehaving servers

9197f220d8541c54d4eb5f804947397e12e2f224 by bz:
dpaa2: fdt improve detection for dpmac/phys

91987a959730e051086b6d1ba55b0fa76c2695ef by bz:
dpaa2: defer link_state updates until we are up

e0910cf2d6958e8e4593dd7488eb2c98c603859b by bz:
dpaa2: make software VLANs usable on dpni

c3216127bcf059a38207e0c18a638a3970efcdcf by bz:
mii: resort VSC8641 entry in miidevs

45000447c1a08cabc379631c16b519caf26f202a by bz:
mii: add Vitesse/Microsemi VSC8514

b50d8a1608805dce7e1fa213c87c84a8d772d877 by bz:
net80211: make ieee80211_alloc_node() private

24df98cc9d9dce1b6b3d47d340f9eb77445d2d2c by bz:
net80211: de-inline ieee80211_ref_node()

02c014aaf2662f6a26c4a418b83432ca2c975009 by bz:
net80211: pass __func__, __LINE__ also to ieee80211_alloc_node()

c0398e3323b442cb9670784e686ef8263bd1490a by bz:
LinuxKPI: 802.11: add unconditional error reporting

d27f3b8c7e6486ed0750286d7ec65e61935ce409 by bz:
iwlwifi: re-enable "Invalid TXQ id" logging

1d2f963afd83b5b06b2a0c143e480e613dbc8608 by bz:
LinuxKPI: 802.11: error on state transition failure

d425c3c640a395654c1e16954c76bcebe6c93cc9 by bz:
LinuxKPI: 802.11: fix ieee80211_add_channel_cbw() argument

861bf0606a5b13ecc796c278c57b5e51830d68ba by bz:
LinuxKPI: 802.11: deal with scan_ie_len

bf0d632e4844c38ce5b5ee1599e2b4553bfe3322 by bz:
LinuxKPI: 802.11: zero-pad debug flags

bd10aa138e78b621ee82288bc11d7543c33a9a35 by bz:
net80211: add ieee80211_add_vhtcap_ch()

5f760ad573d1458b33403cb5ca1b1977c7f7170a by bz:
net80211: rename iv_flags_vht to iv_vht_flags

981462ddddb348c945956fbb015abe7e092a3565 by bz:
net80211: combine iv_vhtcaps and iv_vht_mcsinfo

7019af03949f689cab24bc2cbded5ce4be28f90e by bz:
net80211: migrate ic_vhtcaps, ic_vht_mcsinfo, ic_flags_vht

a8c36fd7a3e8af322bdb06886e40a79d1a614ac6 by bz:
net80211: remove ieee80211_unref_node()

The failed test cases:

4 tests failed.
FAILED:  sys.kern.ptrace_test.ptrace__follow_fork_both_attached_unrelated_debugger

Error Message:
/usr/src/tests/sys/kern/ptrace_test.c:592: WIFSTOPPED(status) not met

FAILED:  sys.netinet6.frag6.frag6_10.frag6_10

Error Message:
atf-check failed; see the output of the test for details

FAILED:  sys.netpfil.common.tos.pf_tos

Error Message:
atf-check failed; see the output of the test for details


Error Message:
Test program did not exit cleanly