FreeBSD-main-amd64-test - Build #24453 - Still Unstable

From: <>
Date: Tue, 28 Nov 2023 09:50:19 UTC
FreeBSD-main-amd64-test - Build #24453 (d2de66a90d01810b1869b7dcac290267f05e4b1d) - Still Unstable

Build information:
Full change log:
Full build log:

Status explanation:
"Unstable" - some tests are suspected being broken by the following changes
"Still Unstable" - the failing test cases have not been fixed by these
                   following changes and this is a notification to note that
                   these changes have not been fully tested by the CI system

Change summaries:
(Those commits are likely but not certainly responsible)

4064a1108b51b24903c8d67db21e8dbaf89b475f by glebius:
netgraph: increase size of sockaddr_ng to match maximum node name

d2de66a90d01810b1869b7dcac290267f05e4b1d by glebius:
ng_socket: with getsockname() return node ID for unnamed node

The failed test cases:

5 tests failed.
FAILED:  sys.audit.administrative.auditctl_success

Error Message:
Test case cleanup timed out

FAILED:  sys.kqueue.libkqueue.kqueue_test.main

Error Message:
Returned non-success exit status 1

FAILED:  sys.netpfil.common.dummynet.pf_queue

Error Message:
We failed prioritisation 1 times

FAILED:  bin.pwait.pwait_test.or_flag

Error Message:
atf-check failed; see the output of the test for details

FAILED:  sys.kqueue.proc3_test.proc3

Error Message:
/usr/src/contrib/netbsd-tests/kernel/kqueue/t_proc3.c:89: ke.fflags & NOTE_CHILD not met