FreeBSD-main-amd64-test - Build #23640 - Still Unstable

From: <>
Date: Tue, 30 May 2023 14:48:35 UTC
FreeBSD-main-amd64-test - Build #23640 (153145efcd998f38ea169c28319fc74f4c6b08a0) - Still Unstable

Build information:
Full change log:
Full build log:

Status explanation:
"Unstable" - some tests are suspected being broken by the following changes
"Still Unstable" - the failing test cases have not been fixed by these
                   following changes and this is a notification to note that
                   these changes have not been fully tested by the CI system

Change summaries:
(Those commits are likely but not certainly responsible)

1fc174cba6e0b949f7499d195dc36bf8df15df4f by kib:
open(2): fix typo

b71f278465ed680019532b8388a163f1d428cc00 by cc:
siftr: convert this tval.tv_sec to type intmax_t to print across

cb1fc924d2c0b87ad27e3741aabf641d35797e2e by bapt:
genl: add new command to list genetlink(4)

153145efcd998f38ea169c28319fc74f4c6b08a0 by bapt:
src.conf.5: regen after readd of NETLINK option

The failed test cases:

4 tests failed.
FAILED:  sys.fs.fusefs.last_local_modify.main

Error Message:
Returned non-success exit status 1


Error Message:
atf-check failed; see the output of the test for details


Error Message:
/usr/tests/sys/netlink/ AssertionError


Error Message:
/usr/tests/sys/netlink/ AssertionError