FreeBSD-main-amd64-test - Build #23624 - Still Unstable

From: <>
Date: Sun, 28 May 2023 01:56:56 UTC
FreeBSD-main-amd64-test - Build #23624 (11ce203e0535c1c8f520c9bda81ab9326cf5db80) - Still Unstable

Build information:
Full change log:
Full build log:

Status explanation:
"Unstable" - some tests are suspected being broken by the following changes
"Still Unstable" - the failing test cases have not been fixed by these
                   following changes and this is a notification to note that
                   these changes have not been fully tested by the CI system

Change summaries:
(Those commits are likely but not certainly responsible)

c79a1416955a260424a5dd2013b114ff864bc926 by mckusick:
Updates to UFS/FFS superblock integrity checks when reading a

11ce203e0535c1c8f520c9bda81ab9326cf5db80 by mckusick:
Fix a bug in fsck_ffs(8) triggered by corrupted filesystems.

The failed test cases:

3 tests failed.
FAILED:  sys.netpfil.common.dummynet.pf_queue

Error Message:
We failed prioritisation 1 times


Error Message:
/usr/tests/sys/netlink/ AssertionError


Error Message:
/usr/tests/sys/netlink/ AssertionError