FreeBSD-main-amd64-test - Build #23622 - Still Unstable

From: <>
Date: Sat, 27 May 2023 20:11:23 UTC
FreeBSD-main-amd64-test - Build #23622 (b498331b037f20bde90b46fc37678fbd421dcf09) - Still Unstable

Build information:
Full change log:
Full build log:

Status explanation:
"Unstable" - some tests are suspected being broken by the following changes
"Still Unstable" - the failing test cases have not been fixed by these
                   following changes and this is a notification to note that
                   these changes have not been fully tested by the CI system

Change summaries:
(Those commits are likely but not certainly responsible)

1f571f8767e6e48e7175cdaa27ed11d0c473d4c2 by dim:
Apply libc++ fix for compiling <type_traits> with clang 16

b498331b037f20bde90b46fc37678fbd421dcf09 by bdrewery:
netgdb: Fix netgdb double ack, print proxy address

The failed test cases:

3 tests failed.
FAILED:  sys.fs.fusefs.mknod.main

Error Message:
Returned non-success exit status 1


Error Message:
/usr/tests/sys/netlink/ AssertionError


Error Message:
/usr/tests/sys/netlink/ AssertionError