FreeBSD-main-amd64-test - Build #23550 - Still Unstable

From: <>
Date: Tue, 16 May 2023 10:15:00 UTC
FreeBSD-main-amd64-test - Build #23550 (e0155c6989049da43c5499f7129002aa17d1ca79) - Still Unstable

Build information:
Full change log:
Full build log:

Status explanation:
"Unstable" - some tests are suspected being broken by the following changes
"Still Unstable" - the failing test cases have not been fixed by these
                   following changes and this is a notification to note that
                   these changes have not been fully tested by the CI system

Change summaries:
(Those commits are likely but not certainly responsible)

e0155c6989049da43c5499f7129002aa17d1ca79 by bapt:
pw: The pw_checkname function has added ';' checking.

The failed test cases:

3 tests failed.
FAILED:  bin.pkill.pkill-j_test.main

Error Message:
1 of 4 tests failed

FAILED:  sys.fs.fusefs.mknod.main

Error Message:
Returned non-success exit status 1

FAILED:  sys.netgraph.ng_macfilter_test.main

Error Message:
TAP test program yielded invalid data: Load of '/tmp/kyua.Jwq1rJ/8845/stdout.txt' failed: Output did not contain any TAP plan and the program did not bail out