FreeBSD-main-amd64-test - Build #23478 - Still Unstable

From: <>
Date: Thu, 04 May 2023 16:57:35 UTC
FreeBSD-main-amd64-test - Build #23478 (5fd34912b4a51f6ebe55d0d832fab4f3c60228e7) - Still Unstable

Build information:
Full change log:
Full build log:

Status explanation:
"Unstable" - some tests are suspected being broken by the following changes
"Still Unstable" - the failing test cases have not been fixed by these
                   following changes and this is a notification to note that
                   these changes have not been fully tested by the CI system

Change summaries:
(Those commits are likely but not certainly responsible)

5fd34912b4a51f6ebe55d0d832fab4f3c60228e7 by imp:
stand: Fix oversight in updating OpenZFS: Add

The failed test cases:

3 tests failed.
FAILED:  sys.fs.fusefs.mknod.main

Error Message:
Returned non-success exit status 1

FAILED:  sys.kern.ptrace_test.ptrace__follow_fork_both_attached_unrelated_debugger

Error Message:
/usr/src/tests/sys/kern/ptrace_test.c:594: WIFSTOPPED(status) not met

FAILED:  sys.netlink.test_snl.snl_parse_errmsg_capped

Error Message:
1 checks failed; see output for more details