FreeBSD-main-amd64-test - Build #23476 - Still Unstable

From: <>
Date: Thu, 04 May 2023 01:42:18 UTC
FreeBSD-main-amd64-test - Build #23476 (4194bbb34c60a5bf0fd0ba28f7bfa20b7842ba3f) - Still Unstable

Build information:
Full change log:
Full build log:

Status explanation:
"Unstable" - some tests are suspected being broken by the following changes
"Still Unstable" - the failing test cases have not been fixed by these
                   following changes and this is a notification to note that
                   these changes have not been fully tested by the CI system

Change summaries:
(Those commits are likely but not certainly responsible)

4194bbb34c60a5bf0fd0ba28f7bfa20b7842ba3f by emaste:
release: Report disk image filename

The failed test cases:

3 tests failed.
FAILED:  sys.fs.fusefs.mknod.main

Error Message:
Returned non-success exit status 1

FAILED:  sys.netinet6.lpm6.lpm6_test1_success

Error Message:
atf-check failed; see the output of the test for details

FAILED:  sys.netlink.test_snl.snl_parse_errmsg_capped

Error Message:
1 checks failed; see output for more details