FreeBSD-main-amd64-test - Build #23465 - Still Unstable

From: <>
Date: Tue, 02 May 2023 14:32:44 UTC
FreeBSD-main-amd64-test - Build #23465 (42f722e721cd010ae5759a4b0d3b7b93c2b9cad2) - Still Unstable

Build information:
Full change log:
Full build log:

Status explanation:
"Unstable" - some tests are suspected being broken by the following changes
"Still Unstable" - the failing test cases have not been fixed by these
                   following changes and this is a notification to note that
                   these changes have not been fully tested by the CI system

Change summaries:
(Those commits are likely but not certainly responsible)

32bb28d8ad31294579bd95c29e84a5985e543ae5 by kib:
amd64: move definition of the struct pmap_pcids into _pmap.h

86b61ccb34d44e0e73dd2a68174ebc869ebccf8e by kib:
amd64 pmap: add pmap_pinit_pcids() helper

9e0143694ad31b534310a473b993e520264f11e2 by kib:
amd64: add pmap_get_pcid() helper

9c8cbf3819854d9acbf4c0fba43942036f956786 by kib:
amd64 pmap_pcid_alloc(): pass a pointer to struct pmap_pcid instead of

42f722e721cd010ae5759a4b0d3b7b93c2b9cad2 by kib:
amd64: store pcids pmap data in pcpu zone

The failed test cases:

3 tests failed.
FAILED:  sys.geom.class.gate.ggate_test.ggated

Error Message:
atf-check failed; see the output of the test for details

FAILED:  sys.file.path_test.path_pipe_fstatat

Error Message:
/usr/src/tests/sys/file/path_test.c:851: fstatat pipe: Not a directory

FAILED:  sys.netlink.test_snl.snl_parse_errmsg_capped

Error Message:
1 checks failed; see output for more details