FreeBSD-main-amd64-test - Build #23258 - Still Unstable

From: <>
Date: Thu, 30 Mar 2023 17:49:12 UTC
FreeBSD-main-amd64-test - Build #23258 (cab1056105e3fdadf6f2b8cc745cfecfb0411755) - Still Unstable

Build information:
Full change log:
Full build log:

Status explanation:
"Unstable" - some tests are suspected being broken by the following changes
"Still Unstable" - the failing test cases have not been fixed by these
                   following changes and this is a notification to note that
                   these changes have not been fully tested by the CI system

Change summaries:
(Those commits are likely but not certainly responsible)

5faf90050e6c280c314bca58ee61707d8bfdbaf3 by fernape: Bring file up to date.

a2d2f25dd44ce9a7bed1e83cf63ccae9a46b2d0b by fernape: Fix alexbl entry

cc4adc4c4e473d47b687d2ac2757157abd728c81 by emaste:
makefs: remove vestigial '?' cases from top-level getopt(3) loop

45e405603b7f4d33372f32c80453ab5cd0d8fdcf by emaste:
makefs: do not pass mode to open() call lacking O_CREAT

cab1056105e3fdadf6f2b8cc745cfecfb0411755 by markj:
kdb: Modify securelevel policy

The failed test cases:

3 tests failed.
FAILED:  sys.netinet6.ndp.ndp_del_gu_success

Error Message:
atf-check failed; see the output of the test for details


Error Message:
/usr/tests/sbin/ping/ AssertionError

FAILED:  sys.kern.ktls_test.ktls_listening_socket

Error Message:
/usr/src/tests/sys/kern/ktls_test.c:2804: bind(s, (struct sockaddr *)&sin, sizeof(sin)) == 0 not met