FreeBSD-main-amd64-test - Build #23072 - Still Unstable

From: <>
Date: Wed, 01 Mar 2023 03:30:46 UTC
FreeBSD-main-amd64-test - Build #23072 (5e54bb1ea9e904075225dc96641c2ede3fc3273c) - Still Unstable

Build information:
Full change log:
Full build log:

Status explanation:
"Unstable" - some tests are suspected being broken by the following changes
"Still Unstable" - the failing test cases have not been fixed by these
                   following changes and this is a notification to note that
                   these changes have not been fully tested by the CI system

Change summaries:
(Those commits are likely but not certainly responsible)

d1d0ae97ca8837306b2a791829566787d1ac723f by markj:
librss: Remove rss_socket_set_rss_bucket()

317fa5169d35c508a05c520a764630252adebea8 by markj:
netinet: Remove the IP(V6)_RSS_LISTEN_BUCKET socket option

996606792ff9cfb2a115b6c6ee3d456afa5047f3 by phk:
Add deprecation notice to the gbde(8) program, scheduled to be removed

dc8616edc580806afb1efaec1cdc3cc9a1b3804e by kevans:
arm64: set FPEN if we're stuck with HCR_EL2.E2H

5e54bb1ea9e904075225dc96641c2ede3fc3273c by kevans:
usb: dwc3: implement hw.usb.xhci.use_polling

The failed test cases:

3 tests failed.
FAILED:  libexec.tftpd.functional.rrq_empty_v4

Error Message:
Test case body timed out

FAILED:  sys.netinet6.lpm6.lpm6_test2_success

Error Message:
atf-check failed; see the output of the test for details

FAILED:  usr.bin.yacc.yacc_tests.main

Error Message:
Returned non-success exit status 1