FreeBSD-main-amd64-test - Build #23754 - Still Unstable

From: <>
Date: Mon, 19 Jun 2023 21:59:40 UTC
FreeBSD-main-amd64-test - Build #23754 (dbbaf77801a8f30e49731395e85757f339f345bf) - Still Unstable

Build information:
Full change log:
Full build log:

Status explanation:
"Unstable" - some tests are suspected being broken by the following changes
"Still Unstable" - the failing test cases have not been fixed by these
                   following changes and this is a notification to note that
                   these changes have not been fully tested by the CI system

Change summaries:
(Those commits are likely but not certainly responsible)

14dd001235f993f2c58d8ceddb5b0ac23db02367 by pstef:
sh: also auto-complete built-ins

e60316d1eac91000e187ae248839fca31143090c by markj:
x86: Add defines for a couple of thermal and PM bits

08992b2078f673b2806e0be30d07f41012a650e7 by jhb:
ifconfig: Avoid issues with trying to negate unsigned values.

a3b1138778f347288f0f3f08c1e46b1ea411afdb by jhb:
ifconfig: Consistently use uint32_t for wireless channel flags.

f19ae3633be133c8a30dd9b709451ce71e147bcb by jhb:
ifconfig: Pacify a sign comparison warning in regdomain_sort.

194e059bb80334e6f4f791a186015b20d7f6f4b8 by netchild:
service: Add -E option to set environment variables before starting a

dbbaf77801a8f30e49731395e85757f339f345bf by dim:
Apply llvm fix for hanging gcc builds on 32-bit arm

The failed test cases:

3 tests failed.
FAILED:  sys.fs.fusefs.mknod.main

Error Message:
Returned non-success exit status 1

FAILED:  sys.fs.fusefs.symlink.main

Error Message:
Returned non-success exit status 1

FAILED:  sys.netinet6.frag6.frag6_19.frag6_19

Error Message:
Global IPv6 statistics do not match: 19 != 20