FreeBSD-main-amd64-test - Build #23723 - Still Unstable

From: <>
Date: Tue, 13 Jun 2023 15:04:51 UTC
FreeBSD-main-amd64-test - Build #23723 (6a9cfebaf1cfee2ff39fb5ea1e7077aab423c3f6) - Still Unstable

Build information:
Full change log:
Full build log:

Status explanation:
"Unstable" - some tests are suspected being broken by the following changes
"Still Unstable" - the failing test cases have not been fixed by these
                   following changes and this is a notification to note that
                   these changes have not been fully tested by the CI system

Change summaries:
(Those commits are likely but not certainly responsible)

9f44a47fd07924afc035991af15d84e6585dea4f by melifaro:
ipfw(8): add ioctl/instruction generation tests

6a9cfebaf1cfee2ff39fb5ea1e7077aab423c3f6 by melifaro:
ipfw: simplify action case parser

The failed test cases:

4 tests failed.
FAILED:  sys.netinet6.frag6.frag6_19.frag6_19

Error Message:
Global IPv6 statistics do not match: 19 != 20


Error Message:
atf-check failed; see the output of the test for details


Error Message:
/usr/tests/sys/netlink/ AssertionError


Error Message:
/usr/tests/sys/netlink/ AssertionError