FreeBSD-main-amd64-test - Build #23708 - Still Unstable

From: <>
Date: Sat, 10 Jun 2023 11:07:16 UTC
FreeBSD-main-amd64-test - Build #23708 (6469f9c595c609dd552ec198a16c471c87df7c57) - Still Unstable

Build information:
Full change log:
Full build log:

Status explanation:
"Unstable" - some tests are suspected being broken by the following changes
"Still Unstable" - the failing test cases have not been fixed by these
                   following changes and this is a notification to note that
                   these changes have not been fully tested by the CI system

Change summaries:
(Those commits are likely but not certainly responsible)

6469f9c595c609dd552ec198a16c471c87df7c57 by grahamperrin:
hier(7): improvement, modernisation

The failed test cases:

3 tests failed.
FAILED:  sys.netinet6.frag6.frag6_19.frag6_19

Error Message:
Global IPv6 statistics do not match: 19 != 20


Error Message:
/usr/tests/sys/netlink/ AssertionError


Error Message:
/usr/tests/sys/netlink/ AssertionError