FreeBSD-main-amd64-test - Build #23706 - Still Unstable

From: <>
Date: Sat, 10 Jun 2023 05:54:34 UTC
FreeBSD-main-amd64-test - Build #23706 (a254f671025f3da313e1d02646b6402f54006e14) - Still Unstable

Build information:
Full change log:
Full build log:

Status explanation:
"Unstable" - some tests are suspected being broken by the following changes
"Still Unstable" - the failing test cases have not been fixed by these
                   following changes and this is a notification to note that
                   these changes have not been fully tested by the CI system

Change summaries:
(Those commits are likely but not certainly responsible)

5ad6c907f99443ebbe9e152d4e68a18b7fa01fff by emaste:
Cirrus-CI: add a manually triggered aarch64-gcc12 task

a254f671025f3da313e1d02646b6402f54006e14 by kib:
rtld: fix typo in comment

The failed test cases:

3 tests failed.
FAILED:  sys.netinet6.frag6.frag6_19.frag6_19

Error Message:
Global IPv6 statistics do not match: 19 != 20


Error Message:
/usr/tests/sys/netlink/ AssertionError


Error Message:
/usr/tests/sys/netlink/ AssertionError