FreeBSD-main-amd64-test - Build #23704 - Still Unstable

From: <>
Date: Fri, 09 Jun 2023 23:01:09 UTC
FreeBSD-main-amd64-test - Build #23704 (2c01176a2802cb261d56a09c9faf9bff9dfb3536) - Still Unstable

Build information:
Full change log:
Full build log:

Status explanation:
"Unstable" - some tests are suspected being broken by the following changes
"Still Unstable" - the failing test cases have not been fixed by these
                   following changes and this is a notification to note that
                   these changes have not been fully tested by the CI system

Change summaries:
(Those commits are likely but not certainly responsible)

29866ecb89620f1c798b7f5ff6710255f13aa52e by andrew:
Update the Arm Optimized Routines

1dd169af7143db4df613f273e565919c1c2b53f5 by andrew:
Add more arm64 ID registers to the user_regs array

2c01176a2802cb261d56a09c9faf9bff9dfb3536 by dim:
msun: Correct FreeBSD version in sincos() man page

The failed test cases:

4 tests failed.

Error Message:
atf-check failed; see the output of the test for details

FAILED:  sys.netinet6.frag6.frag6_19.frag6_19

Error Message:
Global IPv6 statistics do not match: 19 != 20


Error Message:
/usr/tests/sys/netlink/ AssertionError


Error Message:
/usr/tests/sys/netlink/ AssertionError