FreeBSD-main-amd64-test - Build #23687 - Still Unstable

From: <>
Date: Wed, 07 Jun 2023 07:02:17 UTC
FreeBSD-main-amd64-test - Build #23687 (1177a6c8dcfd6625c541d6ffc3c6915b8b6354f7) - Still Unstable

Build information:
Full change log:
Full build log:

Status explanation:
"Unstable" - some tests are suspected being broken by the following changes
"Still Unstable" - the failing test cases have not been fixed by these
                   following changes and this is a notification to note that
                   these changes have not been fully tested by the CI system

Change summaries:
(Those commits are likely but not certainly responsible)

1177a6c8dcfd6625c541d6ffc3c6915b8b6354f7 by delphij:
gve: Unobfuscate code by using nitems directly for loop.

The failed test cases:

3 tests failed.
FAILED:  sys.netinet6.frag6.frag6_19.frag6_19

Error Message:
Global IPv6 statistics do not match: 19 != 20


Error Message:
/usr/tests/sys/netlink/ AssertionError


Error Message:
/usr/tests/sys/netlink/ AssertionError