FreeBSD-main-amd64-test - Build #23679 - Still Unstable

From: <>
Date: Mon, 05 Jun 2023 23:34:49 UTC
FreeBSD-main-amd64-test - Build #23679 (d66540e829ec22b9654cf4b9119bed9326f89fad) - Still Unstable

Build information:
Full change log:
Full build log:

Status explanation:
"Unstable" - some tests are suspected being broken by the following changes
"Still Unstable" - the failing test cases have not been fixed by these
                   following changes and this is a notification to note that
                   these changes have not been fully tested by the CI system

Change summaries:
(Those commits are likely but not certainly responsible)

e730066a64e60b3ba39b7143aa40b5ba1e9c3949 by emaste:
decryptcore: Request the OpenSSL 1.1 API

fbc445addf9183d180bb8b488281617bb19d9242 by des:
xargs: Consistently use strtonum() to parse arguments.

a7bca6949252f32bb39440cb2914ba23e1c01551 by kib:
rtld_tls.h: style

283a4f409731ba3a4eb1be41e151c20e8a960c03 by kib:
rtld: rename tls_done to tls_static

91880e07f605edb90339685bc934699a4344de3b by kib:
rtld: do not allow both dynamic DTV index and static TLS offset

d66540e829ec22b9654cf4b9119bed9326f89fad by tuexen:
tcp: improve sending of TTL/hoplimit and DSCP

The failed test cases:

3 tests failed.
FAILED:  sys.netinet6.frag6.frag6_19.frag6_19

Error Message:
Global IPv6 statistics do not match: 19 != 20


Error Message:
/usr/tests/sys/netlink/ AssertionError


Error Message:
/usr/tests/sys/netlink/ AssertionError