FreeBSD-main-amd64-test - Build #23662 - Still Unstable

From: <>
Date: Fri, 02 Jun 2023 22:12:29 UTC
FreeBSD-main-amd64-test - Build #23662 (0981275c75d5678172eb9dd8fbc89ef61c05c979) - Still Unstable

Build information:
Full change log:
Full build log:

Status explanation:
"Unstable" - some tests are suspected being broken by the following changes
"Still Unstable" - the failing test cases have not been fixed by these
                   following changes and this is a notification to note that
                   these changes have not been fully tested by the CI system

Change summaries:
(Those commits are likely but not certainly responsible)

7811cca8722dbf91df4144be462ec220c690f294 by glebius:
netlink: fix compilation withous INET6

9ad8dc721e57bdccd55532a01bde251502966a95 by markj:
ossl: Expose more CPUID bits in OPENSSL_ia32cap_P

9a3444d91c706dda65040138acbdb8c932213960 by markj:
ossl: Add a VAES-based AES-GCM implementation for amd64

9b1d87286c78266dc76d32a06ed19bf3e93c0a3b by markj:
ossl: Add a fallback AES-GCM implementation using AES-NI

6a3e9a885a9f27863883fc9500975e4e6f6c9fde by markj:
nlsysevent: Fix the EXPORT_SYMS definition

1e078fb6021ebb5ccfb092fe9e5befcf4054ac0b by 0mp:
nproc.1: Fix "first appeared in" details

30ff1255fcd6fc2cdb96924d3185dd7fa6c31c68 by mav:
Fix panic in nfs bootp/diskless after 0785c323f3.

ee06552d625f267e4a73217ce8a9bd63de3d6cfd by jhb:
<sys/memrange.h>: Include <sys/ioccom.h>.

67f938c5ff1a4c90fcb9372132c8458ed67aba57 by markj:
kevent: Make references to filter definitions const

7266f5249848512b99d4dc78256af148f9df986e by markj:
x86: Mark the CPU idle function table as const

056305d3aa2bdb93e57c7a3d369e5742b1b404b8 by markj:
ipsec: Make algorithm tables read-only

556b43492297617d0eb69ea19e3e01701e787b71 by markj:
ossl: Compile newly added files into the kernel if so requested

0981275c75d5678172eb9dd8fbc89ef61c05c979 by grahamperrin:
rc(8): document how to reload rc's configuration

The failed test cases:

6 tests failed.
FAILED:  sys.netinet6.frag6.frag6_19.frag6_19

Error Message:
Global IPv6 statistics do not match: 19 != 20

FAILED:  sys.netpfil.common.dummynet.pf_interface_removal

Error Message:
atf-check failed; see the output of the test for details

FAILED:  sys.netpfil.common.dummynet.pf_pipe

Error Message:
atf-check failed; see the output of the test for details

FAILED:  sys.netpfil.common.dummynet.pf_pipe_v6

Error Message:
atf-check failed; see the output of the test for details


Error Message:
/usr/tests/sys/netlink/ AssertionError


Error Message:
/usr/tests/sys/netlink/ AssertionError