FreeBSD-main-amd64-test - Build #22892 - Still Unstable

From: <>
Date: Tue, 31 Jan 2023 03:00:25 UTC
FreeBSD-main-amd64-test - Build #22892 (b9ef0689433d7d08c96695e571c4c262a3ac9007) - Still Unstable

Build information:
Full change log:
Full build log:

Status explanation:
"Unstable" - some tests are suspected being broken by the following changes
"Still Unstable" - the failing test cases have not been fixed by these
                   following changes and this is a notification to note that
                   these changes have not been fully tested by the CI system

Change summaries:
(Those commits are likely but not certainly responsible)

ef7d10fde4f650c7e9ef207af53d5f116b689826 by phil:
Add missing check for xo_parse_args return code.

bcad3f96ae97671e50faaa6d8226ec4f598ba929 by glebius:
gh-bc: fix build with WITHOUT_NLS_CATALOGS=YES

e400b695991bf3f336e9cbe39e400943d8b1d676 by dumbbell:
linuxkpi: Add `freeram` and `freehigh` to `struct sysinfo`

19be627cfda7e509fc3444fd57de8a0a501aee04 by dumbbell:
linuxkpi: Define `might_alloc()`

25faccaaca6a0bddd60fbad0033606435a13e6b8 by dumbbell:
linuxkpi: Add <linux/limits.h>

7649b89cc12696d540b20ad2f5896827b102225e by dumbbell:
linuxkpi: Add <linux/pgtable.h>

9dafbd0c69a6aade69b23a649548b6c7133f1091 by dumbbell:
linuxkpi: Add `kmap_local_page_prot()` and `kunmap_local()`

29d0c85c86347cd3eafe3c8974c693abf8d9ca51 by dumbbell:
linuxkpi: Add `io_mapping_map_local_wc()` and `io_mapping_unmap_local()`

11aaefc9ca8537be0ea5f62a5927dd39a6109e4f by dumbbell:
linuxkpi: Try to solve headers dependencies

b9ef0689433d7d08c96695e571c4c262a3ac9007 by dumbbell:
linuxkpi: Define `dev_is_platform()` and `to_platform_device()`

The failed test cases:

3 tests failed.
FAILED:  sys.aio.aio_test.aio_socket_blocking_short_write

Error Message:
Test case body timed out

FAILED:  sys.aio.aio_test.aio_socket_blocking_short_write_vectored

Error Message:
Test case body timed out

FAILED:  sys.aio.aio_test.aio_socket_short_write_cancel

Error Message:
/usr/src/tests/sys/aio/aio_test.c:1396: aio_error(&iocb) == EINPROGRESS not met