FreeBSD-main-amd64-test - Build #22886 - Still Unstable

From: <>
Date: Mon, 30 Jan 2023 11:44:50 UTC
FreeBSD-main-amd64-test - Build #22886 (bbe0def9b079e929c1920b00e60b713dbb6b7474) - Still Unstable

Build information:
Full change log:
Full build log:

Status explanation:
"Unstable" - some tests are suspected being broken by the following changes
"Still Unstable" - the failing test cases have not been fixed by these
                   following changes and this is a notification to note that
                   these changes have not been fully tested by the CI system

Change summaries:
(Those commits are likely but not certainly responsible)

349aac52ac1921af6c51deda8c23b12515d8f855 by pho:
stress2: Added a test scenario for "out of inodes" issue with UFS+SU

bbdd27f9d72941e736bec94d0538b0cdf8d26224 by pho:
stress2: Avoid unrelated disk full messages from tests

bbe0def9b079e929c1920b00e60b713dbb6b7474 by pho:
stress2: Added a syzkaller reproducer

The failed test cases:

4 tests failed.
FAILED:  sys.fs.fusefs.mknod.main

Error Message:
Returned non-success exit status 1

FAILED:  sys.aio.aio_test.aio_socket_blocking_short_write

Error Message:
Test case body timed out

FAILED:  sys.aio.aio_test.aio_socket_blocking_short_write_vectored

Error Message:
Test case body timed out

FAILED:  sys.aio.aio_test.aio_socket_short_write_cancel

Error Message:
/usr/src/tests/sys/aio/aio_test.c:1396: aio_error(&iocb) == EINPROGRESS not met