FreeBSD-main-amd64-test - Build #22884 - Still Unstable

From: <>
Date: Mon, 30 Jan 2023 07:23:29 UTC
FreeBSD-main-amd64-test - Build #22884 (4bbf45cf561012da0eb10afe14d4da841add84f5) - Still Unstable

Build information:
Full change log:
Full build log:

Status explanation:
"Unstable" - some tests are suspected being broken by the following changes
"Still Unstable" - the failing test cases have not been fixed by these
                   following changes and this is a notification to note that
                   these changes have not been fully tested by the CI system

Change summaries:
(Those commits are likely but not certainly responsible)

4bbf45cf561012da0eb10afe14d4da841add84f5 by delphij:
etcupdate: Chase test case after pwd_mkdb(8) no longer copies comments.

The failed test cases:

3 tests failed.
FAILED:  sys.aio.aio_test.aio_socket_blocking_short_write

Error Message:
Test case body timed out

FAILED:  sys.aio.aio_test.aio_socket_blocking_short_write_vectored

Error Message:
Test case body timed out

FAILED:  sys.aio.aio_test.aio_socket_short_write_cancel

Error Message:
/usr/src/tests/sys/aio/aio_test.c:1396: aio_error(&iocb) == EINPROGRESS not met