FreeBSD-main-amd64-test - Build #22862 - Still Unstable

From: <>
Date: Thu, 26 Jan 2023 04:22:48 UTC
FreeBSD-main-amd64-test - Build #22862 (0bd4c448ec1dfdc2300a6cacca42e1fc7c4d8f14) - Still Unstable

Build information:
Full change log:
Full build log:

Status explanation:
"Unstable" - some tests are suspected being broken by the following changes
"Still Unstable" - the failing test cases have not been fixed by these
                   following changes and this is a notification to note that
                   these changes have not been fully tested by the CI system

Change summaries:
(Those commits are likely but not certainly responsible)

0bd4c448ec1dfdc2300a6cacca42e1fc7c4d8f14 by mckusick:
Rewrite to avoid Coverity false positive.

The failed test cases:

5 tests failed.
FAILED:  sys.geom.class.gate.ggate_test.ggated

Error Message:
atf-check failed; see the output of the test for details

FAILED:  usr.sbin.etcupdate.preworld_test.main

Error Message:
Returned non-success exit status 1

FAILED:  sys.aio.aio_test.aio_socket_blocking_short_write

Error Message:
Test case body timed out

FAILED:  sys.aio.aio_test.aio_socket_blocking_short_write_vectored

Error Message:
Test case body timed out

FAILED:  sys.aio.aio_test.aio_socket_short_write_cancel

Error Message:
/usr/src/tests/sys/aio/aio_test.c:1396: aio_error(&iocb) == EINPROGRESS not met