FreeBSD-main-amd64-test - Build #22856 - Still Unstable

From: <>
Date: Wed, 25 Jan 2023 10:58:04 UTC
FreeBSD-main-amd64-test - Build #22856 (5a00612149308403ecbf26f56a46f11190211911) - Still Unstable

Build information:
Full change log:
Full build log:

Status explanation:
"Unstable" - some tests are suspected being broken by the following changes
"Still Unstable" - the failing test cases have not been fixed by these
                   following changes and this is a notification to note that
                   these changes have not been fully tested by the CI system

Change summaries:
(Those commits are likely but not certainly responsible)

d90ff31ae5cd9ba073fbd6a7b2367b5209ea534e by des:
w: Complete libxo transition.

d8c9f80891872a54d0b21933136644d915096fe3 by des:
libc: Update mktime(3) / timegm(3) tests.

5a00612149308403ecbf26f56a46f11190211911 by manu:
arm64: Move device scmi to std.arm

The failed test cases:

4 tests failed.
FAILED:  usr.sbin.etcupdate.preworld_test.main

Error Message:
Returned non-success exit status 1

FAILED:  sys.aio.aio_test.aio_socket_blocking_short_write

Error Message:
Test case body timed out

FAILED:  sys.aio.aio_test.aio_socket_blocking_short_write_vectored

Error Message:
Test case body timed out

FAILED:  sys.aio.aio_test.aio_socket_short_write_cancel

Error Message:
/usr/src/tests/sys/aio/aio_test.c:1396: aio_error(&iocb) == EINPROGRESS not met