FreeBSD-main-amd64-test - Build #22848 - Still Unstable

From: <>
Date: Mon, 23 Jan 2023 19:45:55 UTC
FreeBSD-main-amd64-test - Build #22848 (8089749d38781946c008372f4016d69eee549f1c) - Still Unstable

Build information:
Full change log:
Full build log:

Status explanation:
"Unstable" - some tests are suspected being broken by the following changes
"Still Unstable" - the failing test cases have not been fixed by these
                   following changes and this is a notification to note that
                   these changes have not been fully tested by the CI system

Change summaries:
(Those commits are likely but not certainly responsible)

7d189f669836b81dbdeb7bc7178040a43ab9d1fe by karels:
growfs(7): conditionalize mention of adding dump device

8089749d38781946c008372f4016d69eee549f1c by emaste:
blacklistd: diff reduction against upstream

The failed test cases:

5 tests failed.
FAILED:  lib.libc.time.mktime_test.timegm_epoch

Error Message:
/usr/src/contrib/netbsd-tests/lib/libc/time/t_mktime.c:98: Expected errno 0, got 84, in t == (time_t)0

FAILED:  usr.sbin.etcupdate.preworld_test.main

Error Message:
Returned non-success exit status 1

FAILED:  sys.aio.aio_test.aio_socket_blocking_short_write

Error Message:
Test case body timed out

FAILED:  sys.aio.aio_test.aio_socket_blocking_short_write_vectored

Error Message:
Test case body timed out

FAILED:  sys.aio.aio_test.aio_socket_short_write_cancel

Error Message:
/usr/src/tests/sys/aio/aio_test.c:1396: aio_error(&iocb) == EINPROGRESS not met