FreeBSD-main-amd64-test - Build #22813 - Still Unstable

From: <>
Date: Tue, 17 Jan 2023 19:10:48 UTC
FreeBSD-main-amd64-test - Build #22813 (431d2a81d421d4db7a07833b4fd12015cbae5ee7) - Still Unstable

Build information:
Full change log:
Full build log:

Status explanation:
"Unstable" - some tests are suspected being broken by the following changes
"Still Unstable" - the failing test cases have not been fixed by these
                   following changes and this is a notification to note that
                   these changes have not been fully tested by the CI system

Change summaries:
(Those commits are likely but not certainly responsible)

021562c5020dd63d6b812369a9020b3b8147bfbd by gshapiro:
Sync with vendor sendmail 8.17.1 cf/cf/

431d2a81d421d4db7a07833b4fd12015cbae5ee7 by gshapiro:
Minor changes to force commit these files so new freebsd*.cf files are

The failed test cases:

6 tests failed.
FAILED:  lib.libc.time.mktime_test.timegm_epoch

Error Message:
/usr/src/contrib/netbsd-tests/lib/libc/time/t_mktime.c:98: Expected errno 0, got 84, in t == (time_t)0


Error Message:
atf-check failed; see the output of the test for details

FAILED:  usr.sbin.etcupdate.preworld_test.main

Error Message:
Returned non-success exit status 1

FAILED:  sys.aio.aio_test.aio_socket_blocking_short_write

Error Message:
Test case body timed out

FAILED:  sys.aio.aio_test.aio_socket_blocking_short_write_vectored

Error Message:
Test case body timed out

FAILED:  sys.aio.aio_test.aio_socket_short_write_cancel

Error Message:
/usr/src/tests/sys/aio/aio_test.c:1396: aio_error(&iocb) == EINPROGRESS not met